nombre
type: DatatypeProperty
range: string
comment: name of a person @en
comment: nombre de una persona
label: name @en
domain: Persona

Género
type: DatatypeProperty
range: string
domain: Persona

Nombre completo
type: DatatypeProperty
range: string
comment: The fullname of a person, including names and surnames @en
comment: El nombre completo de un apersona incluyendo nombres y apellidos.
label: Fullname @en
domain: Persona
domain: FormalOrganization

Persona
type: Class
comment: Estructura basica de una persona definida en el vocabulario FOAF.

Nacimiento
type: Class
subclass of: evento
comment: El evento del nacimiento de alguien.
label: Birth @en

evento
type: Class
comment: Un evento en la vida.
label: event @en

lugar
type: Property
type: DatatypeProperty
range: string
comment: The place of an event. @en
comment: El lugar de un evento.
label: place @en
domain: evento

Instante
type: Class
comment: Instante de tiempo.

tieneFin
type: Property
type: DatatypeProperty
comment: Define una instancia de finalizacion de algo.

tiene inicio
comment: Define una instancia de inicio de algo.

Parlamentario
type: Class
comment: Una persona que es parlamentario.
comment: A person that is parlamentary. @en
label: Parliamentary @en

Diputado
type: Class
subclass of: Parlamentario
subclass of: Cargo público
comment: A parlamentary that is deputy. @en
comment: Un Parlamentario que es diputado.
label: Deputy @en

Cargo público
type: Class
subclass of: Cargo

Cargo
type: Class

Senador
type: Class
subclass of: Parlamentario
subclass of: Cargo público
comment: A parlamentary that is Senator. @en
comment: Un parlamentario que es senador.
label: Senator @en

Presidente de la Republica
type: Class
subclass of: Cargo público
comment: A politician that is president of the republic (of a country). @en
comment: Un politico que es presidente de la republica (de un pais).
label: President of Republic @en

Presidente del Senado.
type: Class
subclass of: Senador
comment: A senator that is president of Senate. @en
comment: Un senador que es presidente del Senado.
label: President of Senate @en

Presidente de la camara de diputados
type: Class
subclass of: Diputado
comment: A Deputy that is president of house of representatives. @en
comment: Un diputado que es presidente de la camara de diputados.
label: President of House of representatives @en

profesión
type: DatatypeProperty
range: string
comment: The profession of a person @en
comment: La profesion de una persona
label: profession @en
domain: Persona

Ha nacido
type: Property
type: ObjectProperty
range: Nacimiento
sub property of: eventoDeVida
comment: relaciona a una persona con los datos de su nacimiento
comment: relates a person with their birth data @en
label: Has born @en
domain: Persona

eventoDeVida
type: Property
type: ObjectProperty
comment: Define un evento en la vida de alguien

Muerte
type: Class
subclass of: evento
comment: El evento de la muerte de alguien.
label: Death @en

Ha muerto
type: Property
type: ObjectProperty
range: Muerte
comment: Indicates the data of a person when has died. @en
comment: Indica los datos de una persona cuando ha muerto.
label: Has died @en
domain: Persona

fecha
type: ObjectProperty
range: DateTimeDescription
comment: Identifies a date @en
comment: Identifica una fecha
label: date @en
domain: evento

Periodo parlamentario
type: Class
subclass of: Periodo en cargo
comment: Defines a temporal period for a parliamentary @en
comment: Define un periodo temporal para un parlamentario
label: Parliamentary period @en

Periodo en cargo
type: Class
subclass of: Instante

tiene nombramiento parlamentario
type: Property
type: ObjectProperty
sub property of: tiene cargo por periodo
comment: Relaciona un parlamentario con un periodo.
comment: Relates a parlamentary with a parlamentary period. @en
label: has parliamentary appointment. @en

tiene cargo por periodo
type: ObjectProperty
range: Periodo en cargo
domain: Persona

Partido político
type: Class
subclass of: FormalOrganization
comment: Define un partido politico al que puede pertenecer una persona
comment: Defines a political party, which can belong a person @en
label: Political party @en

has political party
type: Property
type: ObjectProperty
range: Partido político
comment: Relates a parlamentary period with a political party. @en
comment: Relaciona un periodo parlamentario con un partido politico.
label: tiene partido politico
domain: Periodo parlamentario

religión
type: DatatypeProperty
range: string
comment: La creencia religiosa de una persona
comment: The religious belief of a person @en
label: religion @en
domain: Persona

Ontologia de biografias parlamentarias
type: Ontology
comment: Esta ontologia modela en rdfs y owl clases y relaciones en el dominio de biografias de parlamentarios.
comment: This ontology allow modeling, using RDFs and OWL, relations in the domain of parliamentary biographies. @en
label: Parliamentary biographies ontology @en
version info: 0.2

Candidato
type: Class
comment: A politician that wants be elected. @en
comment: Un politico que quiere ser electo.
label: Candidate @en

tiene fundador parlamentario
type: Property
type: ObjectProperty
range: Persona
comment: Describe una relacion entre un parlamentario y un partido politico, en donde el parlamentario es fundador del partido.
label: has parliamentary founder @en
domain: Partido político

tiene fecha de fundacion
type: Property
type: ObjectProperty
range: DateTimeDescription
comment: Define la fecha de fundacion de un partido politico
label: has foundation date @en
domain: Partido político

tiene fundador
type: DatatypeProperty
range: string
comment: corresponde a una propiedad generica para definir un fundador de partido politico
label: has founder @en
domain: Partido político

tiene referente
type: Property
type: ObjectProperty
comment: Define que algo tiene como referente a otra cosa.
label: has referring @en
domain: Partido político

tiene partido politico como referencia
type: Property
type: ObjectProperty
range: Partido político
comment: Describe una relacion en donde un partido politico tiene a otro partido politico como referencia.
label: has political party as referring @en
domain: Partido político

es parte de
type: ObjectProperty
range: FormalOrganization
domain: Cargo

tiene cargo
type: ObjectProperty
range: Cargo público
domain: Periodo en cargo

tiene inicio
type: ObjectProperty
range: DateTimeDescription
sub property of: tiene inicio
sub property of: fecha
domain: Periodo en cargo

tiene fin
type: ObjectProperty
range: DateTimeDescription
sub property of: tieneFin
domain: Periodo en cargo

tiene representación parlamentaria en
type: Property
comment: Indica un lugar en el cual un parlamentario ha sido elegido, o el lugar en donde un partido político ha obtenido una representación parlamentaria
domain: Parlamentario
domain: Partido político

tiene cargo público
type: ObjectProperty
sub property of: tiene cargo por periodo

Rol
type: Class
comment: Condición que toma una persona en un contexto dado.

usado por
type: ObjectProperty
range: Periodo en cargo
domain: Cargo

fecha original
type: DatatypeProperty
range: string
domain: DateTimeDescription

tiene periodo
type: ObjectProperty
range: Interval
domain: Periodo en cargo

Ministro
type: Class
subclass of: Cargo público
comment: Persona que dirige cada uno de los departamentos ministeriales en que se divide la gobernación del Estado

Concejal
type: Class
subclass of: Cargo público
comment: Autoridad municipal perteneciente al concejo municipal.

Alcalde
type: Class
subclass of: Cargo público
comment: Autoridad máxima de una comuna.

Consejero
type: Class
subclass of: Cargo público

Director
type: Class
subclass of: Cargo

Intendente
type: Class
subclass of: Cargo público
comment: Máxima autoridad provincial regional, representante del poder ejecutivo.

Plenipotenciario
type: Class
subclass of: Cargo público
comment: Dicho de una persona: Enviada por los reyes y las repúblicas a los congresos o a otros Estados, con el pleno poder y facultad de tratar, concluir y ajustar las paces u otros intereses.

Ministro de Hacienda
type: Class
subclass of: Ministro

Ministro del Interior y Seguridad Pública
type: Class
subclass of: Ministro

Ministro de Relaciones Exteriores
type: Class
subclass of: Ministro

Regidor
type: Class
subclass of: Cargo público

Ministro de Educación
type: Class
subclass of: Ministro

Ministro de Obras Públicas
type: Class
subclass of: Ministro

Ministro de Justicia
type: Class
subclass of: Ministro

Ministro de Energía
type: Class
subclass of: Ministro

Ministro de Minería
type: Class
subclass of: Ministro

Ministro de Agricultura
type: Class
subclass of: Ministro

Ministros de Industria, Obras Públicas y Ferrocarriles
type: Class
subclass of: Ministro
equivalent class: Ministro de Obras Públicas

Ministro de Defensa Nacional
type: Class
subclass of: Ministro

Ministro de Salubridad
type: Class
subclass of: Ministro

Ministro de Guerra
type: Class
subclass of: Ministro
equivalent class: Ministro de Defensa Nacional

Ministro del Trabajo y Previsión Social
type: Class
subclass of: Ministro

Ministro de Economía, Fomento y Turismo
type: Class
subclass of: Ministro

Ministro Secretario General de Gobierno
type: Class
subclass of: Ministro

es representado por
type: ObjectProperty
range: Persona
domain: Partido político

tiene representación en
type: DatatypeProperty
range: string
comment: referencia al label de una división electoral del país
domain: Partido político

compuesto por
type: ObjectProperty
range: Partido político
comment: Utilizada para modelar las coaliciones de partidos
domain: Partido político

representando a un lugar llamado
type: DatatypeProperty
range: string
domain: Periodo parlamentario

representa a un partido político llamado
type: DatatypeProperty
range: string
domain: Periodo parlamentario

representa a
type: ObjectProperty
domain: Periodo parlamentario