Offering
type: Class
subclass of: Thing
comment: An offer to transfer some rights to an item (for example sell or donate) or to provide a service.
term status: testing

GS1 vocabulary
type: Ontology
description: The GS1 RDF vocabulary, described using W3C RDF Schema and the Web Ontology Language.

Trade Item
type: Class
subclass of: Thing
comment: Any item (product or service) upon which there is a need to retrieve pre-defined information and that may be priced, or ordered, or invoiced at any point in any supply chain.
label: Produkt @de
label: Produit @fr
term status: testing

Party
type: Class
subclass of: Thing
comment: A Party (or) Location is any legal or physical entity involved at any point in any supply chain and upon which there is a need to retrieve predefined information. A Party is uniquely identified by a Global Location Number (GLN).
term status: testing

Food Beverage Tobacco Trade Item
type: Class
subclass of: Trade Item
comment: A food, beverage or tobacco product.
term status: testing

Beverage
type: Class
subclass of: Food Beverage Tobacco Trade Item
comment: Any potable liquid.
term status: testing

Seafood
type: Class
subclass of: Food Beverage Tobacco Trade Item
comment: Seafood Trade Items.
term status: testing

Milk Butter Cream Yogurt Cheese Eggs Substitutes
type: Class
subclass of: Food Beverage Tobacco Trade Item
comment: Contains properties related specifically to milk butter cream yogurts cheese eggs and any substitutes for these products.
term status: testing

Fruits and Vegetables
type: Class
subclass of: Food Beverage Tobacco Trade Item
comment: Contains properties related specifically to fruit and vegetable products.
term status: testing

Meat Poultry
type: Class
subclass of: Food Beverage Tobacco Trade Item
comment: Contains properties related specifically to meat and poultry products.
term status: testing

Wearable Trade Item
type: Class
subclass of: Trade Item
comment: A product that is worn on the body.
term status: testing

Clothing
type: Class
subclass of: Wearable Trade Item
comment: A product that is worn on the body.
term status: testing

Footwear
type: Class
subclass of: Wearable Trade Item
comment: Outerwear that is worn on the feet such as shoes or boots.
term status: testing

Amount Type
type: Class
comment: An amount type is a value interpreted in combination with a respective currency code.
term status: testing

Type Code
type: Class
subclass of: Thing
comment: A code list.
term status: testing

Measurement Type
type: Class
comment: A measurement type is a numerical interval that represents the range of a certain measurement property in terms of the lower and upper bounds. It is to be interpreted in combination with the respective unit of measurement. Most measurement types are intervals even if they are in practice often treated as a single point value.
term status: testing

Nutrition Measurement Type
type: Class
subclass of: Measurement Type
comment: A class providing nutritional value and intake percent.
term status: testing

Address
type: Class
comment: The location at which a particular organization or person may be found or reached.
term status: testing

Brand
type: Class
comment: Information on brands and sub-brands for a trade item.
term status: testing

Contact
type: Class
comment: Information on an individual or department acting as point of contact for an organisation.
term status: testing

Country
type: Class
comment: A country is a complex data type that indicates a country and a country subdivision.
term status: testing

Dimension
type: Class
comment: Provides the length, width, and depth of an item with their associated unit of measure.
term status: testing

Certification
type: Class
comment: Information about the type of certification issued by a certifying body.
term status: testing

Food and Beverage Preparation Information
type: Class
comment: Food and Beverage Preparation Information is a complex data type that indicates a preparation state code and preparation instructions.
term status: testing

Packaging
type: Class
comment: Details on packaging for a trade item.
term status: testing

Referenced File
type: Class
subclass of: Thing
comment: Provides URL and other information on a referenced electronic file.
term status: testing

Textile Material
type: Class
comment: Details on the composition of any materials used to make a trade item using textiles.
term status: testing

Warranty
type: Class
comment: An assurance that the trade item is reliable and that repairs or replacement will be done free of charge within a given time limit and under certain conditions in the event of a defect.
term status: testing

Wearable Product Size
type: Class
comment: Size information related to a wearable product. This is the size of the actual item and does not include packaging
term status: testing

Award Prize
type: Class
comment: Describes a prize or award won by a product or party.
term status: testing

Price
type: Class
comment: Information on the trade item price.
term status: testing

Food Beverage Tobacco Ingredient
type: Class
comment: Food and Beverage Ingredient Information is a complex data type that includes an ingredient statement and details.
term status: testing

Daily Value Intake Percent
type: Property
range: float
comment: The percentage of the recommended daily intake of a nutrient as recommended by authorities of the target market. Is expressed relative to the serving size and base daily value intake.
domain: Nutrition Measurement Type

Accreditation Code
type: Property
type: FunctionalProperty
type: ObjectProperty
range: PackagingMarkedLabelAccreditationCode
comment: A marking that the product received recognition, endorsement, certification by following guidelines by the label issuing agency. This does not represent claims for regulatory purposes on products such as free from markings.
domain: Trade Item
term status: testing

Additional Trade Item Classification Code
type: Property
type: FunctionalProperty
type: ObjectProperty
range: string
comment: Code specifying the applied additional trade item classification scheme.
domain: Trade Item
term status: testing

Additional Trade Item Classification Value
type: Property
type: DatatypeProperty
type: FunctionalProperty
range: string
comment: Code specifying an additional trade item classification other than the GS1 Global Product Classification. The applied classification scheme is specified as additional information together with the classification value.
domain: Trade Item
term status: testing

Additional Trade Item Classification Code Description
type: Property
type: DatatypeProperty
type: FunctionalProperty
range: string
sub property of: description
comment: A description for the code value.
domain: Trade Item
term status: testing

Additional Trade Item Description
type: Property
type: DatatypeProperty
type: FunctionalProperty
range: string
sub property of: description
comment: Additional variants necessary to communicate to the industry to help define the product. Multiple variants can be established for each GTIN for e.g. Style, Colour, and Fragrance .
domain: Trade Item
term status: testing

Additional Trade Item Identification Value
type: Property
type: DatatypeProperty
type: FunctionalProperty
range: string
comment: Additional means to the Global Trade Item Number to identify a trade item.
domain: Trade Item
term status: testing

Additive Name
type: Property
type: FunctionalProperty
type: ObjectProperty
range: string
comment: The name of any additive or genetic modification contained or not contained in the trade item .
domain: Trade Item
term status: testing

Additive Level Of Containment
type: Property
type: FunctionalProperty
type: ObjectProperty
range: LevelOfContainmentCode
comment: Code indicating the level of presence of the additive.
domain: Trade Item
term status: testing

Colour Description
type: Property
type: DatatypeProperty
type: FunctionalProperty
range: string
sub property of: description
comment: A description of the colour of an object.
domain: Trade Item
term status: testing

Colour Code List
type: Property
type: FunctionalProperty
type: ObjectProperty
range: ColourCodeListCode
comment: The parties controlling the colour code lists. Dependent on colour code value.
domain: Trade Item
term status: testing

Colour Code
type: Property
type: DatatypeProperty
type: FunctionalProperty
range: string
comment: A code depicting the colour of an object according to a specific code list. The applied code list is specified as additional information together with the colour code.
domain: Trade Item
term status: testing

Consumer First Availability Date Time
type: Property
type: DatatypeProperty
type: FunctionalProperty
range: datetime
comment: The first date/time that the buyer is allowed to sell the trade item to consumers. Usually related to a specific geography. ISO 8601 date format CCYY-MM-DDTHH:MM:SS.
domain: Trade Item
term status: testing

Consumer Usage Instructions
type: Property
type: DatatypeProperty
type: FunctionalProperty
range: string
comment: Free text containing the usage instructions of a product, which are normally held on the label or accompanying the product. This information may or may not be labelled on the pack.
domain: Trade Item
term status: testing

Consumer Package Disclaimer
type: Property
type: DatatypeProperty
type: FunctionalProperty
range: string
comment: Additional information that should be used in advertising and in displaying.
domain: Trade Item
term status: testing

Consumer Safety Information
type: Property
type: DatatypeProperty
type: FunctionalProperty
range: string
comment: Information on consumer safety regarding the trade item.
domain: Trade Item
term status: testing

Consumer Sales Condition Code
type: Property
type: DatatypeProperty
type: FunctionalProperty
range: ConsumerSalesConditionsCode
comment: A code depicting restrictions imposed on the Trade Item regarding how it can be sold to the consumer for example Prescription Required.
domain: Trade Item
term status: testing

Consumer Storage Instructions
type: Property
type: DatatypeProperty
type: FunctionalProperty
range: string
comment: Expresses in text the consumer storage instructions of a product which are normally held on the label or accompanying the product. This information may or may not be labelled on the pack.
domain: Trade Item
term status: testing

Country Of Origin Statement
type: Property
type: FunctionalProperty
type: ObjectProperty
range: string
comment: A description of the geographic area the item may have originated from or has been processed.
domain: Trade Item
term status: testing

Descriptive Size
type: Property
type: FunctionalProperty
type: ObjectProperty
range: string
comment: An alphanumeric size factor the brand owner wishes to communicate to the consumer. IE Jumbo, Capri, Full Length, Maxi For the business requirements for item, please use the specific definition of this data type and field, 1-35, as defined in the Trade Item BRD.
domain: Trade Item
term status: testing

Functional Name
type: Property
type: DatatypeProperty
type: FunctionalProperty
range: string
comment: Describes use of the product or service by the consumer. Should help clarify the product classification associated with the GTIN.
domain: Trade Item
term status: testing

GPC Category Code
type: Property
type: DatatypeProperty
type: FunctionalProperty
range: string
comment: 8-digit code specifying a product category according to the GS1 Global Product Classification (GPC) standard.
domain: Trade Item
term status: testing

GPC Category Description
type: Property
type: DatatypeProperty
type: FunctionalProperty
range: string
sub property of: description
comment: A description of the code specifying a product category according to the GS1 Global Product Classification (GPC) standard.
domain: Trade Item
term status: testing

Gross Weight
type: Property
type: FunctionalProperty
type: ObjectProperty
range: Measurement Type
comment: Used to identify the gross weight of the trade item. The gross weight includes all packaging materials of the trade item. At pallet level the trade itemGrossWeight includes the weight of the pallet itself. For example, 200 grm, value - total pounds, total grams, etc.
domain: Trade Item
term status: testing

Growing Method
type: Property
type: FunctionalProperty
type: ObjectProperty
range: GrowingMethodCode
comment: The process through which fresh produce is grown and cultivated.
domain: Trade Item
term status: testing

GTIN 14
type: Property
type: DatatypeProperty
type: FunctionalProperty
range: string
comment: The GS1 Identification Key used to identify trade items. The key comprises a GS1 Company Prefix followed by an Item Reference Number and a Check Digit.
domain: Trade Item
term status: testing

GTIN 8
type: Property
type: DatatypeProperty
type: FunctionalProperty
range: string
comment: The 8-digit GS1 Identification Key composed of a GS1-8 Prefix, Item Reference, and Check Digit used to identify trade items.
domain: Trade Item
term status: testing

GTIN 12
type: Property
type: DatatypeProperty
type: FunctionalProperty
range: string
comment: The 12-digit GS1 Identification Key composed of a GS1 Company Prefix, Item Reference, and Check Digit used to identify trade items.
domain: Trade Item
term status: testing

GTIN 13
type: Property
type: DatatypeProperty
type: FunctionalProperty
range: string
comment: The 13-digit GS1 Identification Key composed of a GS1 Company Prefix, Item Reference, and Check Digit used to identify trade items.
domain: Trade Item
term status: testing

Health Claim
type: Property
type: DatatypeProperty
type: FunctionalProperty
range: string
sub property of: description
comment: A description of health claims according to regulations of the target market.
domain: Trade Item
term status: testing

Included Accessories
type: Property
type: DatatypeProperty
type: FunctionalProperty
range: string
comment: Any included object or device not part of the core product itself but which adds to its functionality or use.
domain: Trade Item
term status: testing

Is Trade Item Recalled
type: Property
type: DatatypeProperty
type: FunctionalProperty
range: boolean
comment: An indicator for the Trade Item to determine if the Manufacturer or Supplier has recalled the product.
domain: Trade Item
term status: testing

Trade Item Marketing Message
type: Property
type: DatatypeProperty
type: FunctionalProperty
range: string
sub property of: description
comment: Consumer-friendly marketing detailed description of the product.
comment: Marketing message associated to the Trade item.
label: Marketing Message
domain: Trade Item
term status: testing

Net Content
type: Property
type: FunctionalProperty
type: ObjectProperty
range: Measurement Type
comment: The quantity of the trade item contained by a package, usually as claimed on the label. Indicates the net content of the total trade item. For fixed value trade items use the value claimed on the package, to avoid variable fill rate issue that arises with some trade item which are sold by volume or weight, and whose actual content may vary slightly from batch to batch.
domain: Trade Item
term status: testing

Net Weight
type: Property
type: FunctionalProperty
type: ObjectProperty
range: Measurement Type
comment: Used to identify the net weight of the trade item. Net weight applies to all levels but consumer unit level. Net Weight excludes all packaging material, including the packaging material of all lower-level GTINs. Example:11.5 kgm.
domain: Trade Item
term status: testing

Organic Claim Agency Code
type: Property
type: DatatypeProperty
type: FunctionalProperty
range: OrganicClaimAgencyCode
comment: A governing body that creates and maintains standards related to organic products.
domain: Trade Item
term status: testing

Organic Percent Claim
type: Property
type: DatatypeProperty
range: float
comment: The percent of actual organic materials per weight of the trade item. This is usually claimed on the product.
domain: Trade Item
term status: testing

Provenance Statement
type: Property
type: DatatypeProperty
range: string
sub property of: description
comment: Free text description of the region or place the product originates from. This is to be specifically used to specify areas such as cities, mountain ranges, regions. Examples: Made in Th�ringen Mountains, Made in Paris, From the Napa Valley.
domain: Trade Item
term status: testing

Product Range
type: Property
type: DatatypeProperty
range: string
comment: A name, used by a Brand Owner, that span multiple consumer categories or uses. E.g. (Waist Watchers).
domain: Trade Item
term status: testing

Production Variant Description
type: Property
type: DatatypeProperty
range: string
sub property of: description
comment: Free text assigned by the manufacturer to describe the production variant. Examples are: package series X, package series Y.
domain: Trade Item
term status: testing

Production Variant Effective Date Time
type: Property
type: DatatypeProperty
range: datetime
comment: The start date of a production variant. The variant applies to products having a date mark (a best before date or expiration date) on the package that comes on or after the effective date.
domain: Trade Item
term status: testing

Has Award Prize
type: Property
type: DatatypeProperty
range: Award Prize
comment: An award or prize given to the trade item.
domain: Trade Item
term status: testing

Has Brand Owner
type: Property
type: DatatypeProperty
range: Party
comment: The brand owner of the trade item. The party that is responsible for allocating GS1 System Identification Keys. The administrator of a GS1 Company Prefix.
domain: Trade Item
term status: testing

Has Manufacturer
type: Property
type: DatatypeProperty
range: Party
comment: The party that produces the item.
domain: Trade Item
term status: testing

Has Manufacturing Plant
type: Property
type: DatatypeProperty
range: Party
comment: A physical location consisting of one or more buildings with facilities for manufacturing.
domain: Trade Item
term status: testing

Has Customer Support Centre
type: Property
type: DatatypeProperty
range: Party
comment: The party which provides product support to the trading partner party to which merchandise is sold.
domain: Trade Item
term status: testing

Has Production Facility
type: Property
type: DatatypeProperty
type: FunctionalProperty
range: Party
comment: General description of the contact for the trade item for example Production Facility 3.
domain: Trade Item
term status: testing

Has dependent Proprietary Trade Item
type: Property
type: DatatypeProperty
range: Trade Item
comment: Dependent trade items are Trade Items which are required to make the current trade item functional.
domain: Trade Item
term status: testing

Has Equivalent Trade Item
type: Property
type: DatatypeProperty
range: Trade Item
comment: A product which can be substituted for the trade item based on supplier-defined functional equivalence to the trade item.
domain: Trade Item
term status: testing

Has Primary Alternate Trade Item
type: Property
type: DatatypeProperty
range: Trade Item
comment: A Trade Item that is similar to the current Trade Item but is not exact match. Same form fit function, e.g. same product different colour, different package size, better quality.
domain: Trade Item
term status: testing

Has Replaced By Trade Item
type: Property
type: DatatypeProperty
range: Trade Item
comment: The trade item which permanently replaces the current trade item. This Trade Item is sent in the record for the original item that is being replaced.
domain: Trade Item
term status: testing

Has Replaced Trade Item
type: Property
type: DatatypeProperty
range: Trade Item
comment: Indicates the trade item identification of an item that is being permanently replaced by this trade item.
domain: Trade Item
term status: testing

regulatedProductName
type: Property
type: DatatypeProperty
range: string
comment: The prescribed, regulated or generic product name or denomination that describes the true nature of the product. For example for a food product in order to distinguish it from other foods according to country specific regulations.
domain: Trade Item
term status: testing

Size Code List Code
type: Property
type: ObjectProperty
range: string
comment: Code specifying a size code list. Allowed code values are specified in GS1 Code List SizeCodeListCode .
domain: Trade Item
term status: testing

Size Code
type: Property
type: DatatypeProperty
range: string
comment: A code depicting the size of an object according to a specific code list. The applied code list is specified as additional information together with the size code.
domain: Trade Item
term status: testing

Supplier Specified Minimum Consumer Storage Days
type: Property
type: DatatypeProperty
range: integer
comment: Represents the number of days between a product's sell by date and its use by date.
domain: Trade Item
term status: testing

Trade Item Description
type: Property
type: DatatypeProperty
range: string
sub property of: description
comment: An understandable and useable description of a trade item using brand and other descriptors. This attribute is filled with as little abbreviation as possible while keeping to a reasonable length. Free form text field, this data element is repeatable for each language used and must be associated with a valid ISO language code. Field length is 178 characters. This should be a meaningful description of the trade item with full spelling to facilitate message processing. Retailers can use this description as the base to fully understand the brand, flavour, scent etc. of the specific GTIN in order to accurately create a product description as needed for their internal systems. Examples: GS1 Brand Base Invisible Solid Deodorant AP Stick Spring Breeze GS1 Brand Laundry Detergent Liquid Compact Regular Instant Stain 1 GS1 Brand Hair Colour Liquid Light to Medium Blonde.
domain: Trade Item
term status: testing

Trade Item Feature Benefit
type: Property
type: DatatypeProperty
range: string
comment: Element for consumer facing marketing content to describe the key features or benefits of the style suitable for display purposes.
domain: Trade Item
term status: testing

Trade Item Form Description
type: Property
type: DatatypeProperty
range: string
sub property of: description
comment: The physical form or shape of the product. Used, for example, in pharmaceutical industry to indicate the formulation of the trade item. Defines the form the trade item takes and is distinct from the form of the packaging.
domain: Trade Item
term status: testing

Trade Item Name
type: Property
type: DatatypeProperty
range: string
sub property of: description
comment: Consumer friendly short description of the product suitable for compact presentation.
label: Product Name
domain: Trade Item
term status: testing

Variant Description
type: Property
type: DatatypeProperty
range: string
sub property of: description
comment: Free text field used to identify the variant of the product. Variants are the distinguishing characteristics that differentiate products with the same brand and size including such things as the particular flavour, fragrance, taste.
domain: Trade Item
term status: testing

Warning Copy Description
type: Property
type: DatatypeProperty
range: string
comment: Warning information is additional information that outlines special requirements, warning and caution information printed on the package.
domain: Trade Item
term status: testing

Has Trade Item Certification
type: Property
type: ObjectProperty
range: Certification
comment: Information on certification to which the trade item complies.
domain: Trade Item
term status: testing

Has Country Of Assembly
type: Property
type: ObjectProperty
range: Country
comment: The place where product is assembled.
domain: Trade Item
term status: testing

Has Country Of Last Processing
type: Property
type: ObjectProperty
range: Country
comment: The place where the trade item or ingredient was last processed and tested before importation.
domain: Trade Item
term status: testing

Has Country Of Origin
type: Property
type: ObjectProperty
range: Country
comment: Code indicating the country of origin of the product.
domain: Trade Item
term status: testing

Has Trade Item Brand
type: Property
type: DatatypeProperty
range: Brand
comment: The brand of the product that appears on the consumer package.
domain: Trade Item
term status: testing

Has In Package Dimensions
type: Property
type: DatatypeProperty
range: Dimension
comment: Product is measured as the package was supplied.
domain: Trade Item
term status: testing

Has Out of Package Dimensions
type: Property
type: DatatypeProperty
range: Dimension
comment: Product is removed from consumer packaging, assembled if necessary for final use and its dimensions. For example: Computer desk; entertainment centre; microwave oven; lawnmower; a floor cleaner; a grouping of table and chairs; stove; telephone; camera; large appliance (e.g. washing machines); small appliance (e.g. food processors).
domain: Trade Item
term status: testing

Has Manufacturer's Warranty
type: Property
type: ObjectProperty
range: Warranty
comment: The warranty associated with the trade item.
domain: Trade Item
term status: testing

Has Packaging
type: Property
type: ObjectProperty
range: Packaging
comment: Details on packaging for a trade item.
domain: Trade Item
term status: testing

Has Product Image
type: Property
type: ObjectProperty
range: Referenced File
comment: Link to a file containing a visual representation of the product.
domain: Trade Item
term status: testing

Has Recipe Website
type: Property
type: ObjectProperty
range: Referenced File
comment: Link to a website containing recipes associated with the product.
domain: Trade Item
term status: testing

Has Instructions For Use
type: Property
type: ObjectProperty
range: Referenced File
comment: Link to a file containing the Instructions For Use.
domain: Trade Item
term status: testing

Has Consumer Handling Storage
type: Property
type: ObjectProperty
range: Referenced File
comment: Link to a website, file, or image containing the manufacturer's recommendations for how the consumer or end user should store and handle the product.
domain: Trade Item
term status: testing

Has Audio File
type: Property
type: ObjectProperty
range: Referenced File
comment: Link to a file containing an audio clip which is relevant to the product. Examples are commercials, or instructional/ how to use audio files.
domain: Trade Item
term status: testing

Has Referenced File
type: Property
type: ObjectProperty
range: Referenced File
comment: Link to a file or website containing additional information on trade item.
domain: Trade Item
term status: testing

Has Certification
type: Property
type: ObjectProperty
range: Certification
comment: Certification for the trade item.
domain: Trade Item
term status: testing

GLN
type: Property
type: DatatypeProperty
range: string
comment: The GS1 Identification Key used to identify physical locations or parties. The key comprises a GS1 Company Prefix, Location Reference, and Check Digit.
domain: Party
term status: testing

Additional Party Identification Type Value
type: Property
type: DatatypeProperty
range: string
comment: The value associated with the Additional Party Identification Type Value.
domain: Party
term status: testing

Party Language
type: Property
type: DatatypeProperty
range: string
comment: ISO 639-1 code specifying the language of an addressed party.
domain: Party
term status: testing

Party Name
type: Property
type: DatatypeProperty
type: ObjectProperty
range: string
comment: The name of the party expressed in text.
domain: Party
domain: Address
term status: testing

Party Role
type: Property
type: DatatypeProperty
range: PartyRoleCode
comment: Code specifying a party role. Allowed code values are specified in GS1 Code List PartyroleCode.
domain: Party
term status: testing

Has Location
type: Property
type: ObjectProperty
range: Address
comment: Links to information about an address for a party.
domain: Party
term status: testing

Has Business Contact
type: Property
type: ObjectProperty
range: Contact
comment: Links to information about a business location for a party.
domain: Party
term status: testing

Has After Hours Contact
type: Property
type: ObjectProperty
range: Contact
comment: Links to afterhours contact information for a party.
domain: Party
term status: testing

City
type: Property
type: ObjectProperty
range: string
comment: Text specifying the name of the city.
domain: Address
term status: testing

Country Code
type: Property
type: DatatypeProperty
type: ObjectProperty
range: string
comment: Code specifying the country for the address using ISO 3166-1.
comment: A short text string code (see values defined in ISO 3166) specifying the country in which a processing or other activity is performed, for example processing, bottling, manufacturing.
domain: Address
domain: Country
term status: testing

CountyCode
type: Property
type: ObjectProperty
range: string
comment: A code that identifies a county. A county is a territorial division in some countries, forming the chief unit of local administration. In the US, a county is a political and administrative division of a state.
domain: Address
term status: testing

PO Box Number
type: Property
type: ObjectProperty
range: string
comment: The number that identifies a PO box. A PO box is a box in a post office or other postal service location assigned to an organization where postal items may be kept.
domain: Address
term status: testing

Postal Code
type: Property
type: ObjectProperty
range: string
comment: Text specifying the postal code for an address.
domain: Address
term status: testing

Province State Code
type: Property
type: ObjectProperty
range: string
comment: Text specifying a province or state in abbreviated format for example NJ.
domain: Address
term status: testing

Cross Street
type: Property
type: ObjectProperty
range: string
comment: A street intersecting a main street (usually at right angles) and continuing on both sides of it.
domain: Address
term status: testing

Street Address One
type: Property
type: ObjectProperty
range: string
comment: The first free form line of an address. This first part is printed on paper as the first line below the name. For example, the name of the street and the number in the street or the name of a building.
domain: Address
term status: testing

Street Address Two
type: Property
type: ObjectProperty
range: string
comment: The second free form line of an address. This second part is printed on paper as the second line below the name. The second free form line complements the first free form line to locate the party e.g. floor number, name of a building, suite number.
domain: Address
term status: testing

Street Address Three
type: Property
type: ObjectProperty
range: string
comment: The third free form line of an address. This third part is printed on paper as the third line below the name. The third free form line complements the first and second free form lines where necessary.
domain: Address
term status: testing

Latitude
type: Property
type: ObjectProperty
range: string
comment: Angular distance North or South from the earth�s equator measured through 90 degrees.
domain: Address
term status: testing

Longitude
type: Property
type: ObjectProperty
range: string
comment: The arc or portion of the earth�s equator intersected between the meridian of a given place and the prime meridian and expressed either in degrees or in time.
domain: Address
term status: testing

Contact Type
type: Property
type: ObjectProperty
range: string
comment: The function or role of a contact for example Customer Support.
domain: Contact
term status: testing

Department Name
type: Property
type: ObjectProperty
range: string
comment: The name of the department that can be contacted to provide additional information.
domain: Contact
term status: testing

Job Title
type: Property
type: ObjectProperty
range: string
comment: The job title of the person that can be contacted for example Manager.
domain: Contact
term status: testing

email
type: Property
type: ObjectProperty
range: string
comment: Creating/sending/receiving of unstructured free text messages or documents using computer network, a mini-computer or an attached modem and regular telephone line or other electronic transmission media.
domain: Contact
term status: testing

Responsibility
type: Property
type: ObjectProperty
range: string
comment: Text further specifying the area of responsibility of the trade contact.
domain: Contact
term status: testing

Telefax
type: Property
type: ObjectProperty
range: string
comment: Device used for transmitting and reproducing fixed graphic material (as printing) by means of signals over telephone lines or other electronic transmission media.
domain: Contact
term status: testing

Telephone
type: Property
type: ObjectProperty
range: string
comment: Voice/data transmission by telephone.
domain: Contact
term status: testing

Has Postal Address
type: Property
type: ObjectProperty
range: Address
comment: The postal address for a contact.
domain: Contact
term status: testing

Award Prize Code
type: Property
type: ObjectProperty
range: string
comment: Indicates the achievement of the product in relation to a prize or award, e.g. winner, runner-up, shortlisted. Optional and non-repeating.
domain: Award Prize
term status: testing

Award Prize Country Code
type: Property
type: ObjectProperty
range: Country
comment: An ISO standard code identifying the country in which a prize or award is given.
domain: Award Prize
term status: testing

Award Prize Description
type: Property
type: ObjectProperty
range: string
comment: Text that describes the awards won.
domain: Award Prize
term status: testing

Award Prize Jury
type: Property
type: ObjectProperty
range: string
comment: Free text listing members of the jury that awarded the prize.
domain: Award Prize
term status: testing

Award Prize Name
type: Property
type: ObjectProperty
range: string
comment: The name of a prize or award which the product has received.
domain: Award Prize
term status: testing

Award Prize Year
type: Property
type: ObjectProperty
range: gYear
comment: The year in which a prize or award was given.
domain: Award Prize
term status: testing

Brand Name
type: Property
type: DatatypeProperty
range: string
comment: The brand name of the product that appears on the consumer package.
domain: Brand
term status: testing

Sub-brand
type: Property
type: DatatypeProperty
range: string
comment: Second level of brand. Can be a trademark. It is the primary differentiating factor that a brand owner wants to communicate to the consumer or buyer. E.g. Yummy-Cola Classic. In this example Yummy-Cola is the brand and Classic is the sub-brand.
domain: Brand
term status: testing

Certification Agency
type: Property
type: DatatypeProperty
range: string
comment: Name of the organization issuing the certification standard or other requirement being met .
domain: Certification
term status: testing

Certification Standard
type: Property
type: DatatypeProperty
range: string
comment: Name of the certification standard. Free text. Example: Egg classification .
domain: Certification
term status: testing

Certification Value
type: Property
type: DatatypeProperty
range: string
comment: The product�s certification standard value. Example:4.
domain: Certification
term status: testing

Depth
type: Property
type: ObjectProperty
range: Measurement Type
comment: The depth of the trade item, as measured according to the GS1 Package Measurement Rules. If the trade item is a unit load, include the shipping platform unless it is excluded according to the Platform Type Code chosen.
domain: Dimension
term status: testing

Diameter
type: Property
type: ObjectProperty
range: Measurement Type
comment: The measurement of the diameter of the trade item at its largest point. For example, 165 mmt.
domain: Dimension
term status: testing

Height
type: Property
type: ObjectProperty
range: Measurement Type
comment: The height of the trade item, as measured according to the GS1 Package Measurement Rules. If the trade item is a unit load, include the shipping platform unless it is excluded according to the Platform Type Code chosen.
domain: Dimension
term status: testing

Width
type: Property
type: ObjectProperty
range: Measurement Type
comment: The width of the trade item, as measured according to the GS1 Package Measurement Rules. If the trade item is a unit load, include the shipping platform unless it is excluded according to the Platform Type Code chosen.
domain: Dimension
term status: testing

Included Quantity
type: Property
type: ObjectProperty
range: Measurement Type
comment: The quantity including unit of measure for which the offer for good or service is valid.
domain: Offering
term status: testing

Included Quantity Maximum
type: Property
type: ObjectProperty
range: Measurement Type
comment: The maximum quantity including unit of measure for which the offer for good or service is valid.
domain: Offering
term status: testing

Included Quantity Minimum
type: Property
type: ObjectProperty
range: Measurement Type
comment: The minimum quantity including unit of measure for which the offer for good or service is valid.
domain: Offering
term status: testing

Offering Description
type: Property
type: ObjectProperty
range: string
sub property of: description
comment: A description of the offering including goods or services offered for sale or use.
domain: Offering
term status: testing

Offering Effective End Date
type: Property
type: ObjectProperty
range: datetime
comment: The date from which the trade item is no longer available from the information provider, including seasonal or temporary trade item and services .
domain: Offering
term status: testing

Offering Effective Start Date
type: Property
type: ObjectProperty
range: datetime
comment: The date from which the trade item is no longer available from the information provider, including seasonal or temporary trade item and services.
domain: Offering
term status: testing

Payment Method Code
type: Property
type: ObjectProperty
range: PaymentMethodCode
comment: A predefined list that identifies a means of payment. For example cheque, bankers draft, credit card, etc.
domain: Offering
term status: testing

Payment Terms
type: Property
type: ObjectProperty
range: string
comment: The type of payment term expressed as a code, for example Discount.
domain: Offering
term status: testing

Included Trade Item
type: ObjectProperty
range: Trade Item
comment: The trade item included in the offering.
domain: Offering
term status: testing

Has Price
type: ObjectProperty
range: Price
comment: The price related to an offering.
domain: Offering
term status: testing

Has Seeker
type: ObjectProperty
range: Party
comment: The party seeking an offering.
domain: Offering
term status: testing

Has Seller
type: ObjectProperty
range: Party
comment: The party seeking to sell a product or service.
domain: Offering
term status: testing

Available From
type: ObjectProperty
range: Address
comment: The location the offered product or service is available from.
domain: Offering
term status: testing

Has Offer Warranty
type: ObjectProperty
range: Warranty
comment: The warranty associated with the offering.
domain: Offering
term status: testing

Packaging Feature
type: Property
type: ObjectProperty
range: PackagingFeatureCode
comment: A packaging feature that facilitates the usage of the product by the consumer. Features do not affect the core composition of the packaging type nor modify its usage.
domain: Packaging
term status: testing

Packaging Function
type: Property
type: ObjectProperty
range: PackagingFunctionCode
comment: A code that is used to identify specific functionality for packaging resulting from specific processes or features present in the packaging type.
domain: Packaging
term status: testing

Packaging Material Composition Quantity
type: Property
type: ObjectProperty
range: Measurement Type
comment: The quantity of the packaging material of the trade item. Can be weight, volume or surface, can vary by country.
domain: Packaging
term status: testing

Packaging Material Type
type: Property
type: ObjectProperty
range: PackagingMaterialTypeCode
comment: The materials used for the packaging of the trade item for example glass or plastic.
domain: Packaging
term status: testing

Packaging Material Thickness
type: Property
type: ObjectProperty
range: Measurement Type
comment: The thickness of a packaging material.
domain: Packaging
term status: testing

Packaging Recycling Scheme
type: Property
type: ObjectProperty
range: PackagingRecyclingSchemeCode
comment: A code determining the recycling scheme the packaging of this trade item will fall within when recycled. Applies to recyclable packaging with or without deposit.
domain: Packaging
term status: testing

Packaging Recycling Process Type
type: Property
type: ObjectProperty
range: PackagingRecyclingProcessTypeCode
comment: The process the packaging could undertake for recyclable & sustainability programs. Examples COMPOSTABLE, ENERGY_RECOVERABLE, REUSABLE.
domain: Packaging
term status: testing

Packaging Shape
type: Property
type: ObjectProperty
range: PackagingShapeCode
comment: A code depicting the shape of a package for example CONE.
domain: Packaging
term status: testing

Packaging Type
type: Property
type: ObjectProperty
range: string
comment: The dominant means used to transport, store, handle or display the trade item as defined by the data source. This packaging is not used to describe any manufacturing process.
domain: Packaging
term status: testing

Returnable Package Deposit Amount
type: Property
type: ObjectProperty
range: Amount Type
comment: The monetary amount for the individual returnable package.
domain: Packaging
term status: testing

Returnable Package Deposit Region
type: Property
type: ObjectProperty
range: Country
comment: The geographic region associated with the returnable package deposit amount.
domain: Packaging
term status: testing

Duty Fee Tax Rate
type: Property
type: ObjectProperty
range: float
comment: The current tax or duty rate percentage applicable to the trade item.
domain: Price
term status: testing

Duty Fee Tax Amount
type: Property
type: ObjectProperty
range: Amount Type
comment: The current tax or duty or fee amount applicable to the trade item.
domain: Price
term status: testing

Duty Fee Tax Description
type: Property
type: ObjectProperty
range: string
comment: A description of tax type for example Taxes sure les supports audio.
domain: Price
term status: testing

Price Type
type: Property
type: ObjectProperty
range: string
comment: Provides a price value along with a currency .
domain: Price
term status: testing

Price Value
type: Property
type: DatatypeProperty
type: ObjectProperty
range: float
range: Amount Type
comment: Provides a price value along with a currency .
comment: A floating-point numeric value that is qualified by the corresponding currency. See gs1:currencyCode
domain: Amount Type
domain: Price
term status: testing

Price Value Maximum
type: Property
type: ObjectProperty
range: Amount Type
comment: Provides a maximum price value .
domain: Price
term status: testing

Price Value Minimum
type: Property
type: ObjectProperty
range: Amount Type
comment: Provides a minimum price value .
domain: Price
term status: testing

Price Basis Quantity
type: Property
type: ObjectProperty
range: Measurement Type
comment: The price basis quantity is the associated quantity of trade item for which a price is given.
domain: Price
term status: testing

Price Effective End Date
type: Property
type: ObjectProperty
range: datetime
comment: The effective end date of the price .
domain: Price
term status: testing

Price Effective Start Date
type: Property
type: ObjectProperty
range: datetime
comment: The effective start date of the price .
domain: Price
term status: testing

File Language Code
type: Property
type: ObjectProperty
range: string
comment: The specified language to which the digital asset is targeted.
domain: Referenced File
term status: testing

File Pixel Height
type: Property
type: ObjectProperty
range: integer
comment: The number of pixels along the vertical axis of the image.
domain: Referenced File
term status: testing

File Pixel Width
type: Property
type: ObjectProperty
range: integer
comment: The number of pixels along the horizontal axis of the image.
domain: Referenced File
term status: testing

File Size
type: Property
type: ObjectProperty
range: Measurement Type
comment: The size of the file as it is stored in an uncompressed format.
domain: Referenced File
term status: testing

Referenced File Effective Start Date
type: Property
type: ObjectProperty
range: datetime
comment: The date upon which the target of this external link begins to be effective for use.
domain: Referenced File
term status: testing

Referenced File Effective Start Date
type: Property
type: ObjectProperty
range: datetime
comment: The date upon which the target of this external link ceases to be effective for use.
domain: Referenced File
term status: testing

Referenced File Type
type: Property
type: ObjectProperty
range: ReferencedFileTypeCode
comment: The type of file that is being referenced for example Safety Data Sheet or Product Image.
domain: Referenced File
term status: testing

Website
type: Property
type: ObjectProperty
range: anyURI
comment: Simple text string that refers to a resource on the internet, URLs may refer to documents, resources, people, etc.
domain: Referenced File
term status: testing

Warranty Description
type: Property
type: ObjectProperty
range: string
sub property of: description
comment: The description of warranty available for the trade item. Allows for the representation of the same value in different languages but not for multiple values.
domain: Warranty
term status: testing

Warranty Duration
type: Property
type: ObjectProperty
range: Measurement Type
comment: The time period that the warranty is valid within.
domain: Warranty
term status: testing

Nutrient Basis Quantity
type: Property
type: ObjectProperty
range: Measurement Type
comment: Quantity on which the nutrient information has been based; for example, per 100 grams. When specified, nutrientBasisQuantity establishes the basis for all contained nutrient records.
domain: Food Beverage Tobacco Trade Item
term status: testing

Nutrient Basis Quantity Type Code
type: Property
type: ObjectProperty
range: NutrientBasisQuantityCode
comment: The type of quantity contained for example measurement, serving size, or container.
domain: Food Beverage Tobacco Trade Item
term status: testing

Nutrient Measurement Precision
type: Property
type: ObjectProperty
range: MeasurementPrecisionCode
comment: The Code indicating whether the specified nutrient content is exact or approximate.
domain: Food Beverage Tobacco Trade Item
term status: testing

Biotin Per Nutrient Basis Quantity
type: Property
type: ObjectProperty
range: Nutrition Measurement Type
comment: Biotin Acid per specified nutrient basis quantity.
domain: Food Beverage Tobacco Trade Item
term status: testing

Calcium Per Nutrient Basis Quantity
type: Property
type: ObjectProperty
range: Nutrition Measurement Type
comment: Calcium per specified nutrient basis quantity.
domain: Food Beverage Tobacco Trade Item
term status: testing

Carbohydrates Per Nutrient Basis Quantity
type: Property
type: ObjectProperty
range: Nutrition Measurement Type
comment: Carbohydrates per specified nutrient basis quantity.
domain: Food Beverage Tobacco Trade Item
term status: testing

Chloride Per Nutrient Basis Quantity
type: Property
type: ObjectProperty
range: Nutrition Measurement Type
comment: Chloride per specified nutrient basis quantity.
domain: Food Beverage Tobacco Trade Item
term status: testing

Chromium Per Nutrient Basis Quantity
type: Property
type: ObjectProperty
range: Nutrition Measurement Type
comment: Chromium per specified nutrient basis quantity.
domain: Food Beverage Tobacco Trade Item
term status: testing

Copper Per Nutrient Basis Quantity
type: Property
type: ObjectProperty
range: Nutrition Measurement Type
comment: Copper per specified nutrient basis quantity.
domain: Food Beverage Tobacco Trade Item
term status: testing

Energy Per Nutrient Basis Quantity
type: Property
type: ObjectProperty
range: Nutrition Measurement Type
comment: Energy Per specified nutrient basis quantity.
domain: Food Beverage Tobacco Trade Item
term status: testing

Fat Per Nutrient Basis Quantity
type: Property
type: ObjectProperty
range: Nutrition Measurement Type
comment: Fat per specified nutrient basis quantity.
domain: Food Beverage Tobacco Trade Item
term status: testing

Fibre Per Nutrient Basis Quantity
type: Property
type: ObjectProperty
range: Nutrition Measurement Type
comment: Fibre per specified nutrient basis quantity.
domain: Food Beverage Tobacco Trade Item
term status: testing

Fluoride Per Nutrient Basis Quantity
type: Property
type: ObjectProperty
range: Nutrition Measurement Type
comment: Fluoride per specified nutrient basis quantity.
domain: Food Beverage Tobacco Trade Item
term status: testing

Folic Acid Per Nutrient Basis Quantity
type: Property
type: ObjectProperty
range: Nutrition Measurement Type
comment: Folic Acid per specified nutrient basis quantity.
domain: Food Beverage Tobacco Trade Item
term status: testing

Iodine Per Nutrient Basis Quantity
type: Property
type: ObjectProperty
range: Nutrition Measurement Type
comment: Iodine per specified nutrient basis quantity.
domain: Food Beverage Tobacco Trade Item
term status: testing

Iron Per Nutrient Basis Quantity
type: Property
type: ObjectProperty
range: Nutrition Measurement Type
comment: Iron per specified nutrient basis quantity.
domain: Food Beverage Tobacco Trade Item
term status: testing

Manganese Per Nutrient Basis Quantity
type: Property
type: ObjectProperty
range: Nutrition Measurement Type
comment: Manganese per specified nutrient basis quantity.
domain: Food Beverage Tobacco Trade Item
term status: testing

Magnesium Per Nutrient Basis Quantity
type: Property
type: ObjectProperty
range: Nutrition Measurement Type
comment: Magnesium per specified nutrient basis quantity.
domain: Food Beverage Tobacco Trade Item
term status: testing

Molybdenum Per Nutrient Basis Quantity
type: Property
type: ObjectProperty
range: Nutrition Measurement Type
comment: Molybdenum per specified nutrient basis quantity.
domain: Food Beverage Tobacco Trade Item
term status: testing

Monounsaturated Fat Per Nutrient Basis Quantity
type: Property
type: ObjectProperty
range: Nutrition Measurement Type
comment: Monounsaturated fat per specified nutrient basis quantity.
domain: Food Beverage Tobacco Trade Item
term status: testing

Polyunsaturated Fat Per Nutrient Basis Quantity
type: Property
type: ObjectProperty
range: Nutrition Measurement Type
comment: Polyunsaturated fat per specified nutrient basis quantity.
domain: Food Beverage Tobacco Trade Item
term status: testing

Niacin Per Nutrient Basis Quantity
type: Property
type: ObjectProperty
range: Nutrition Measurement Type
comment: Niacin per specified nutrient basis quantity.
domain: Food Beverage Tobacco Trade Item
term status: testing

Pantothenic Acid Per Nutrient Basis Quantity
type: Property
type: ObjectProperty
range: Nutrition Measurement Type
comment: Pantothenic Acid per specified nutrient basis quantity.
domain: Food Beverage Tobacco Trade Item
term status: testing

Phosphorus Per Nutrient Basis Quantity
type: Property
type: ObjectProperty
range: Nutrition Measurement Type
comment: Phosphorus per specified nutrient basis quantity.
domain: Food Beverage Tobacco Trade Item
term status: testing

Polyols Per Nutrient Basis Quantity
type: Property
type: ObjectProperty
range: Nutrition Measurement Type
comment: Polyols per specified nutrient basis quantity.
domain: Food Beverage Tobacco Trade Item
term status: testing

Potassium Per Nutrient Basis Quantity
type: Property
type: ObjectProperty
range: Nutrition Measurement Type
comment: Potassium per specified nutrient basis quantity.
domain: Food Beverage Tobacco Trade Item
term status: testing

Protein Per Nutrient Basis Quantity
type: Property
type: ObjectProperty
range: Nutrition Measurement Type
comment: Protein per specified nutrient basis quantity.
domain: Food Beverage Tobacco Trade Item
term status: testing

Riboflavin Per Nutrient Basis Quantity
type: Property
type: ObjectProperty
range: Nutrition Measurement Type
comment: Riboflavin per specified nutrient basis quantity.
domain: Food Beverage Tobacco Trade Item
term status: testing

Salt Per Nutrient Basis Quantity
type: Property
type: ObjectProperty
range: Nutrition Measurement Type
comment: Salt per specified nutrient basis quantity.
domain: Food Beverage Tobacco Trade Item
term status: testing

Saturated Fat Per Nutrient Basis Quantity
type: Property
type: ObjectProperty
range: Nutrition Measurement Type
comment: Saturated fat per specified nutrient basis quantity.
domain: Food Beverage Tobacco Trade Item
term status: testing

Selenium Per Nutrient Basis Quantity
type: Property
type: ObjectProperty
range: Nutrition Measurement Type
comment: Selenium per specified nutrient basis quantity.
domain: Food Beverage Tobacco Trade Item
term status: testing

Sodium Per Nutrient Basis Quantity
type: Property
type: ObjectProperty
range: Nutrition Measurement Type
comment: Sodium per specified nutrient basis quantity.
domain: Food Beverage Tobacco Trade Item
term status: testing

Starch Per Nutrient Basis Quantity
type: Property
type: ObjectProperty
range: Nutrition Measurement Type
comment: Starch per specified nutrient basis quantity.
domain: Food Beverage Tobacco Trade Item
term status: testing

Sugars Per Nutrient Basis Quantity
type: Property
type: ObjectProperty
range: Nutrition Measurement Type
comment: Sugars per specified nutrient basis quantity.
domain: Food Beverage Tobacco Trade Item
term status: testing

Thiamin Per Nutrient Basis Quantity
type: Property
type: ObjectProperty
range: Nutrition Measurement Type
comment: Thiamin per specified nutrient basis quantity.
domain: Food Beverage Tobacco Trade Item
term status: testing

Vitamin A Per Nutrient Basis Quantity
type: Property
type: ObjectProperty
range: Nutrition Measurement Type
comment: Vitamin A per specified nutrient basis quantity.
domain: Food Beverage Tobacco Trade Item
term status: testing

Vitamin B6 Per Nutrient Basis Quantity
type: Property
type: ObjectProperty
range: Nutrition Measurement Type
comment: Vitamin B6 per specified nutrient basis quantity.
domain: Food Beverage Tobacco Trade Item
term status: testing

Vitamin B12 Per Nutrient Basis Quantity
type: Property
type: ObjectProperty
range: Nutrition Measurement Type
comment: Vitamin B12 per specified nutrient basis quantity.
domain: Food Beverage Tobacco Trade Item
term status: testing

Vitamin C Per Nutrient Basis Quantity
type: Property
type: ObjectProperty
range: Nutrition Measurement Type
comment: Vitamin C per specified nutrient basis quantity.
domain: Food Beverage Tobacco Trade Item
term status: testing

Vitamin D Per Nutrient Basis Quantity
type: Property
type: ObjectProperty
range: Nutrition Measurement Type
comment: Vitamin D per specified nutrient basis quantity.
domain: Food Beverage Tobacco Trade Item
term status: testing

Vitamin E Per Nutrient Basis Quantity
type: Property
type: ObjectProperty
range: Nutrition Measurement Type
comment: Vitamin E per specified nutrient basis quantity.
domain: Food Beverage Tobacco Trade Item
term status: testing

Vitamin K Per Nutrient Basis Quantity
type: Property
type: ObjectProperty
range: Nutrition Measurement Type
comment: Vitamin K per specified nutrient basis quantity.
domain: Food Beverage Tobacco Trade Item
term status: testing

Zinc Per Nutrient Basis Quantity
type: Property
type: ObjectProperty
range: Nutrition Measurement Type
comment: Zinc per specified nutrient basis quantity.
domain: Food Beverage Tobacco Trade Item
term status: testing

Allergen Type Code
type: Property
type: ObjectProperty
range: AllergenTypeCode
comment: Code specifying the type of allergen.
domain: Food Beverage Tobacco Trade Item
term status: testing

Allergen Level Of Containment
type: Property
type: ObjectProperty
range: LevelOfContainmentCode
comment: Code specifying the level of presence of the allergen.
domain: Food Beverage Tobacco Trade Item
term status: testing

Allergen Statement
type: Property
type: DatatypeProperty
range: string
sub property of: description
comment: Textual description of the presence or absence of allergens as governed by local rules and regulations, specified as one string.
domain: Food Beverage Tobacco Trade Item
term status: testing

Allergen Specification Agency
type: Property
type: DatatypeProperty
range: string
comment: Agency that controls the allergen definition.
domain: Food Beverage Tobacco Trade Item
term status: testing

Allergen Specification Name
type: Property
type: DatatypeProperty
range: string
comment: Free text field containing the name and version of the regulation or standard that contains the definition of the allergen.
domain: Food Beverage Tobacco Trade Item
term status: testing

Packaging Marked Diet Allergen Type Code
type: Property
type: ObjectProperty
range: PackagingMarkedDietAllergenCode
comment: Indication of which dietary or allergen marks are on the package.
domain: Food Beverage Tobacco Trade Item
term status: testing

Diet Type Code
type: Property
type: ObjectProperty
range: DietTypeCode
comment: Code indicating the diet the product is suitable for example Kosher.
domain: Food Beverage Tobacco Trade Item
term status: testing

Diet Type Description
type: Property
type: ObjectProperty
range: string
sub property of: description
comment: Free text for indication of diet not stated in the list of diets.
domain: Food Beverage Tobacco Trade Item
term status: testing

Diet Type Sub-code
type: Property
type: ObjectProperty
range: string
comment: Indicates a set of agreements or a certificate name that guarantees the product is permitted in a particular diet.
domain: Food Beverage Tobacco Trade Item
term status: testing

Drained Weight
type: Property
type: FunctionalProperty
type: ObjectProperty
range: Measurement Type
comment: The weight of the trade item when drained of its liquid. For example 225 grm, Jar of pickles in vinegar.
domain: Food Beverage Tobacco Trade Item
term status: testing

Food Beverage Target Use Application Code
type: Property
type: ObjectProperty
range: FoodBeverageTargetUseCode
comment: The type of meal the food or beverage product is targeted to for example Breakfast.
domain: Food Beverage Tobacco Trade Item
term status: testing

Genetically Modified Declaration Code
type: Property
type: ObjectProperty
range: LevelOfContainmentCode
comment: A statement of the presence or absence of genetically modified protein or DNA.
domain: Food Beverage Tobacco Trade Item
term status: testing

If Instant
type: Property
type: ObjectProperty
range: NonbinaryLogicCode
comment: Determines whether the product is instant.
domain: Food Beverage Tobacco Trade Item
term status: testing

If Sliced
type: Property
type: ObjectProperty
range: NonbinaryLogicCode
comment: Determines whether the product comes pre-sliced.
domain: Food Beverage Tobacco Trade Item
term status: testing

Irradiated Code
type: Property
type: ObjectProperty
range: NonbinaryLogicCode
comment: Indicates if radiation has been applied to the trade item.
domain: Food Beverage Tobacco Trade Item
term status: testing

Juice Content Percent
type: Property
type: ObjectProperty
range: float
comment: The fruit juice content of the trade item expressed as a percentage.
domain: Food Beverage Tobacco Trade Item
term status: testing

Number of Servings Per Package
type: Property
type: DatatypeProperty
range: float
comment: The total number of servings contained in the package.
domain: Food Beverage Tobacco Trade Item
term status: testing

Number of Servings Per Package Measurement Precision
type: Property
type: ObjectProperty
range: MeasurementPrecisionCode
comment: Code indicating whether the number of servings per package is exact or approximate.
domain: Food Beverage Tobacco Trade Item
term status: testing

Number of Servings Range Description
type: Property
type: DatatypeProperty
range: string
comment: A free text field specifying a range for the number of servings contained in the package.
domain: Food Beverage Tobacco Trade Item
term status: testing

Nutritional Claim Statement
type: Property
type: DatatypeProperty
range: string
comment: Free text field for any additional nutritional claims.
domain: Food Beverage Tobacco Trade Item
term status: testing

Nutritional Claim Code
type: Property
type: ObjectProperty
range: NutritionalClaimTypeCode
comment: Code specifying a nutritional claim applicable to the product.
domain: Food Beverage Tobacco Trade Item
term status: testing

Has Food And Beverage Preparation Information
type: Property
type: ObjectProperty
range: Food and Beverage Preparation Information
comment: links to information about how to prepare a specific Food / Beverage Product.
domain: Food Beverage Tobacco Trade Item
term status: testing

Has Food And Beverage Ingredient Information
type: Property
type: ObjectProperty
range: Food Beverage Tobacco Ingredient
comment: links to information about ingredients of a specific Food / Beverage Product.
domain: Food Beverage Tobacco Trade Item
term status: testing

Packaging Marked Free From Code
type: Property
type: ObjectProperty
range: PackagingMarkedFreeFromCode
comment: Indication of the food ingredients that the package is marked free from.
domain: Food Beverage Tobacco Trade Item
term status: testing

Preservation Technique
type: Property
type: DatatypeProperty
range: PreservationTechniqueCode
comment: Code value indicating the preservation technique used to preserve the product from deterioration.
domain: Food Beverage Tobacco Trade Item
term status: testing

Food Beverage Refrigeration Claim
type: Property
type: DatatypeProperty
range: FoodBeverageRefrigerationClaimCode
comment: Identifies whether or not the product requires refrigeration.
domain: Food Beverage Tobacco Trade Item
term status: testing

Reheating Claim
type: Property
type: DatatypeProperty
range: NonbinaryLogicCode
comment: Free text field for serving suggestion.
domain: Food Beverage Tobacco Trade Item
term status: testing

Serving Size Description
type: Property
type: DatatypeProperty
range: string
comment: A free text field specifying the serving size for which the nutrient information has been stated for example: per 1/3 cup (42 g).
domain: Food Beverage Tobacco Trade Item
term status: testing

Serving Size
type: Property
type: DatatypeProperty
range: Measurement Type
comment: Measurement value specifying the serving size in which the information per nutrient has been stated. Example: Per 100 grams.
domain: Food Beverage Tobacco Trade Item
term status: testing

Serving Suggestion
type: Property
type: DatatypeProperty
range: string
comment: Free text field for serving suggestion.
domain: Food Beverage Tobacco Trade Item
term status: testing

Source Animal Code
type: Property
type: DatatypeProperty
range: SourceAnimalCode
comment: The source of raw material used to produce the food product for example a goat for milk.
domain: Food Beverage Tobacco Trade Item
term status: testing

Cheese Firmness
type: Property
type: DatatypeProperty
range: CheeseFirmnessCode
comment: The firmness of the cheese product for example EXTRA_HARD.
domain: Milk Butter Cream Yogurt Cheese Eggs Substitutes
term status: testing

Cheese Maturation Period Description
type: Property
type: DatatypeProperty
range: string
comment: A descriptive way to specify a date range as some cheeses are matured over a period of time, but not an exact period. For example 3 to 4 weeks, over 1 year etc. The term maturation is also known in other markets as Aged.
domain: Milk Butter Cream Yogurt Cheese Eggs Substitutes
term status: testing

Fat In Milk Content
type: Property
type: DatatypeProperty
range: float
comment: The percentage of fat contained in milk content of the product.
domain: Milk Butter Cream Yogurt Cheese Eggs Substitutes
term status: testing

Fat In Dry Matter
type: Property
type: DatatypeProperty
range: float
comment: The amount of fat contained in the base product expressed in percentage.
domain: Milk Butter Cream Yogurt Cheese Eggs Substitutes
term status: testing

Is Rind Edible
type: Property
type: DatatypeProperty
range: NonbinaryLogicCode
comment: An indicator whether or not the cheese rind is edible. Some cheeses are coated in plastic or their surface is treated with other traditional substances to increase their shelf life. This can result in the rind no longer being edible.
domain: Milk Butter Cream Yogurt Cheese Eggs Substitutes
term status: testing

Is Homogenised
type: Property
type: DatatypeProperty
range: NonbinaryLogicCode
comment: A The indication whether or not the milk used was actively homogenised. The homogenisation of milk is a technical process in the dairy. The milk fat is milled to such an extent that further creaming is prevented.
domain: Milk Butter Cream Yogurt Cheese Eggs Substitutes
term status: testing

Cheese Firmness
type: Property
type: DatatypeProperty
range: SharpnessOfCheeseCode
comment: The descriptive term that is used by the product manufacturer to identify the sharpness of the taste of the product for example EXTRA_SHARP. Usually the longer the aging of the product, the sharper the taste.
domain: Milk Butter Cream Yogurt Cheese Eggs Substitutes
term status: testing

Alcoholic Beverage Sub-region
type: Property
type: DatatypeProperty
range: string
comment: A legally defined geographical region where the grapes for a wine were grown also known as an appellation.
domain: Beverage
term status: testing

Beverage Vintage
type: Property
type: DatatypeProperty
range: string
comment: The year in which the majority of ingredients are harvested and/or the alcoholic beverage is produced. Determination as to whether the vintage year is the harvest date or production date is according to requirements in the Target Market.
domain: Beverage
term status: testing

If Carbonated
type: Property
type: DatatypeProperty
range: NonbinaryLogicCode
comment: Used to identify whether or not a beverage product is naturally effervescent or has been made effervescent by the addition of carbon dioxide gas.
domain: Beverage
term status: testing

If From Concentrate
type: Property
type: DatatypeProperty
range: NonbinaryLogicCode
comment: Used to identify whether or not the product claims to be made from a concentrated formulation.
domain: Beverage
term status: testing

If Decaffeinated
type: Property
type: DatatypeProperty
range: NonbinaryLogicCode
comment: The descriptive term that is used by the product manufacturer to identify whether or not the product contains caffeine.
domain: Beverage
term status: testing

If Vintage
type: Property
type: DatatypeProperty
range: NonbinaryLogicCode
comment: Identifies whether the product makes claim to being vintage.
domain: Beverage
term status: testing

Percentage of Alcohol Per Volume
type: Property
type: DatatypeProperty
range: float
comment: Percentage of alcohol contained in the base unit trade item.
domain: Beverage
term status: testing

Vintner
type: Property
type: DatatypeProperty
range: string
comment: The person hired by a winery or wine company who is responsible for many of the processes in the preparation, taste and quality of the wine produced. The science of wine making is referred to as oenology. The vintner is the oenologist.
domain: Beverage
term status: testing

If Pitted Stoned
type: Property
type: DatatypeProperty
range: NonbinaryLogicCode
comment: The descriptive term that is used by the product manufacturer to identify whether or not a fruit or vegetable product has been de-stoned or pitted prior to being offered for sale.
domain: Fruits and Vegetables
term status: testing

If Seedless
type: Property
type: DatatypeProperty
range: NonbinaryLogicCode
comment: Determines whether the product is seedless as grown.
domain: Fruits and Vegetables
term status: testing

If Shelled or Peeled
type: Property
type: DatatypeProperty
range: NonbinaryLogicCode
comment: The descriptive term that is used by the product manufacturer to identify whether or not the product or its contents have been shelled/peeled prior to being offered for sale.
domain: Fruits and Vegetables
term status: testing

Is Washed Ready To Eat
type: Property
type: DatatypeProperty
range: NonbinaryLogicCode
comment: Determines whether product has been prewashed and is ready to eat.
domain: Fruits and Vegetables
term status: testing

Maturation Method Code
type: Property
type: ObjectProperty
range: MaturationMethodCode
comment: The method of maturity for the item for example tree ripened or jet fresh.
domain: Fruits and Vegetables
term status: testing

Anatomical Form
type: Property
type: DatatypeProperty
range: AnatomicalFormCode
comment: Describes the meat product in terms of whether it is the whole animal or part of the animal which has been cut such as the muscle, bone, organ, or fat.
domain: Meat Poultry
term status: testing

Boneless Claim
type: Property
type: DatatypeProperty
range: NonbinaryLogicCode
comment: The descriptive term that is used by the product manufacturer to identify whether the product makes a specific claim to contain no bones.
domain: Meat Poultry
term status: testing

Meat Poultry Type Code
type: Property
type: DatatypeProperty
range: string
comment: The fish, meat, or poultry type for this food and beverage item.
domain: Meat Poultry
term status: testing

Minimum Meat Poultry Content
type: Property
type: DatatypeProperty
range: Measurement Type
comment: The minimum amount of fish, meat or poultry contained in a food and beverage trade item expressed as a measurement.
domain: Meat Poultry
term status: testing

Catch Area
type: Property
type: DatatypeProperty
range: string
comment: Free text field describing the sea zone from which the trade item was caught in.
domain: Seafood
term status: testing

Fish Type
type: Property
type: DatatypeProperty
range: string
comment: The type of fish for example Sea bass.
domain: Seafood
term status: testing

Fresh or Seawater Farmed
type: Property
type: DatatypeProperty
range: FreshOrSeawaterFarmedCode
comment: A code determining whether the fish originated from the sea or was farmed.
domain: Seafood
term status: testing

Minimum Fish Content
type: Property
type: DatatypeProperty
range: Measurement Type
comment: The minimum amount of fish contained in a food and beverage trade item expressed as a measurement.
domain: Seafood
term status: testing

Style Description
type: Property
type: DatatypeProperty
range: string
comment: An attribute that classifies products that share many of the same characteristics (attribute values) that does NOT vary by GTIN, and are presented by the supplier as a single merchandise selection for the buyer.
domain: Wearable Trade Item
term status: testing

Consumer Lifestage
type: Property
type: DatatypeProperty
range: ConsumerLifestageCode
comment: Indicates, with reference to the product branding, labelling or packaging, the descriptive term that is used by the product manufacturer to identify the period or stage in the consumer's life during which the product is considered to be suitable.
domain: Wearable Trade Item
term status: testing

Is Patterned
type: Property
type: DatatypeProperty
range: NonbinaryLogicCode
comment: The descriptive term that is used by the product manufacturer to identify whether or not the product has a patterned design.
domain: Wearable Trade Item
term status: testing

Is Thermal
type: Property
type: DatatypeProperty
range: NonbinaryLogicCode
comment: The descriptive term that is used to identify whether the product is thermal.
domain: Wearable Trade Item
term status: testing

Is Waterproof
type: Property
type: DatatypeProperty
range: NonbinaryLogicCode
comment: The descriptive term that is used to identify whether or not the product claims to provide waterproofing to the applied surface.
domain: Wearable Trade Item
term status: testing

Is Wearable Item Disposable
type: Property
type: DatatypeProperty
range: NonbinaryLogicCode
comment: Identifies whether or not the product is intended to be disposed of after single use or a limited period of use.
domain: Wearable Trade Item
term status: testing

Target Consumer Gender
type: Property
type: ObjectProperty
range: TargetConsumerGenderCode
comment: Identifies the target consumer gender for which a product has been designed for example MALE
domain: Wearable Trade Item
term status: testing

Target Consumer Age
type: Property
type: DatatypeProperty
range: string
comment: Identifies the target consumer age range for which a trade item has been designed.
domain: Wearable Trade Item
term status: testing

Season Name
type: Property
type: DatatypeProperty
range: string
comment: Element defines the season applicable to the item for example Winter.
domain: Wearable Trade Item
term status: testing

Season Calendar Year
type: Property
type: DataTypeProperty
range: gYear
comment: The calendar year in which the trade item is seasonally available.
domain: Wearable Trade Item
term status: testing

Season Parameter
type: Property
type: ObjectProperty
range: SeasonParameterCode
comment: Indication of the season, in which the trade item is available, i.e. assignment to one of the following collection periods: spring/summer, autumn/ winter or all year around.
domain: Wearable Trade Item
term status: testing

Size Group
type: Property
type: ObjectProperty
range: SizeGroupCode
comment: A code field describing the type of size that is necessary to uniquely specify the size of the item. .
domain: Wearable Trade Item
term status: testing

Size Dimension
type: Property
type: ObjectProperty
range: Measurement Type
comment: The numerical size measurement relating to the size type.
domain: Wearable Trade Item
term status: testing

Size System
type: Property
type: ObjectProperty
range: SizeSystemCode
comment: The system that is being used to define the size for example EUROPE. Size system is used in conjunction with size group to define the size dimension.
domain: Wearable Trade Item
term status: testing

Size Type
type: Property
type: DatatypeProperty
range: SizeTypeCode
comment: The type of size dimension being specified for example SLEEVE.
domain: Wearable Trade Item
term status: testing

Sporting Activity Type
type: Property
type: ObjectProperty
range: SportingActivityTypeCode
comment: The descriptive term that is used by the product manufacturer to identify the type of sporting activity for which the product is intended to be worn for example Football.
domain: Wearable Trade Item
term status: testing

Clothing Cut
type: Property
type: DatatypeProperty
range: string
comment: Supplemental information to indicate the clothing cut or silhouette make of the garment. For example, silhouette details for a pair of jeans such as boot cut, or loose fit, comfort fit.
domain: Clothing
term status: testing

Collar Type
type: Property
type: DatatypeProperty
range: string
comment: A free text description of the type of collar on the garment.
domain: Clothing
term status: testing

Is Maternity
type: Property
type: ObjectProperty
range: boolean
comment: Indicates, with reference to the product branding, labelling or packaging, the descriptive term that is used by the product manufacturer to identify if the product is intended as maternity wear.
domain: Clothing
term status: testing

Has Textile Material
type: Property
type: ObjectProperty
range: Textile Material
comment: Links to information about the material used in a wearable product.
domain: Clothing
term status: testing

Fastening Type
type: Property
type: DatatypeProperty
range: FootwearFasteningTypeCode
comment: Something that mechanically joins or affixes two or more objects together .
domain: Footwear
term status: testing

Footwear Upper Type
type: Property
type: DatatypeProperty
range: UpperTypeCode
comment: The descriptive term that is used by the product manufacturer to identify whether the footwear upper is open or closed. Otherwise known as Open or Closed Upper.
domain: Footwear
term status: testing

Has Upper Material
type: Property
type: DatatypeProperty
range: Textile Material
comment: The material used for the upper part of the footwear product. The upper is the part of a shoe, boot, slipper or other item of footwear that's above the sole.
domain: Footwear
term status: testing

Currency Code
type: Property
type: DatatypeProperty
range: string
comment: A string value indicating a currency from ISO 4217 for example USD .
domain: Amount Type
term status: testing

Measurement Value
type: Property
type: DatatypeProperty
range: float
comment: A floating-point numeric value that is qualified by the corresponding measurement unit code - see gs1:measurementUnitCode
domain: Measurement Type
term status: testing

Measurement Unit
type: Property
type: DatatypeProperty
range: string
comment: A string value indicating a Measurement Unit from UN/ECE Recommendation 20, Units of Measure used in International Trade e.g. GRM = gram - see http://www.unece.org/fileadmin/DAM/cefact/recommendations/rec20/rec20_rev3_Annex3e.pdf
domain: Measurement Type
term status: testing

Country Code
type: Property
type: DatatypeProperty
range: string
comment: A short text string code (see values defined in ISO 3166) specifying the country subdivision in which a processing or other activity is performed, for example processing, bottling, manufacturing.
domain: Country
term status: testing

Convenience Level Percent
type: Property
type: ObjectProperty
range: float
comment: An indication of the ease of preparation for semi-prepared products. The convenience level indicates the level of preparation in percentage required to prepare and helps the consumer to assess how long it will take to prepare the meal.
domain: Food and Beverage Preparation Information
term status: testing

Manufacturer Preparation Type Code
type: Property
type: ObjectProperty
range: PreparationTypeCode
comment: An indication of the preparation methods that a manufacturer has used.
domain: Food and Beverage Preparation Information
term status: testing

Maximum Optimum Consumption Temperature
type: Property
type: ObjectProperty
range: Measurement Type
comment: The upper limit drinking temperature of the optimum range of the drinking temperature. The optimum range of the drinking temperature is a recommendation and is based on the experience of the individual producer. Allows for the representation of the same value in different units of measure but not multiple values.
domain: Food and Beverage Preparation Information
term status: testing

Minimum Optimum Consumption Temperature
type: Property
type: ObjectProperty
range: Measurement Type
comment: The lower limit drinking temperature of the optimum range of the drinking temperature. The optimum range of the drinking temperature is a recommendation and is based on the experience of the individual producer. Allows for the representation of the same value in different units of measure but not multiple values.
domain: Food and Beverage Preparation Information
term status: testing

Preparation Type Code
type: Property
type: ObjectProperty
range: PreparationTypeCode
comment: Code specifying the preparation state of the product for which the nutrient information is valid. PREPARED, UNPREPARED.
domain: Food and Beverage Preparation Information
term status: testing

Preparation Instructions
type: Property
type: DatatypeProperty
range: string
comment: Free text providing instructions on how to prepare the product before serving.
domain: Food and Beverage Preparation Information
term status: testing

Preparation Consumption Precautions
type: Property
type: DatatypeProperty
range: string
comment: Specifies additional precautions to be taken before preparation or consumption of the product.
domain: Food and Beverage Preparation Information
term status: testing

Product Yield
type: Property
type: ObjectProperty
range: Measurement Type
comment: Product quantity after preparation.
domain: Food and Beverage Preparation Information
term status: testing

Product Yield Type Code
type: Property
type: ObjectProperty
range: ProductYieldTypeCode
comment: Code indicating the type of yield measurement. Examples: After dilution, Drained weight, After cooking, etc.
domain: Food and Beverage Preparation Information
term status: testing

Product Yield Variation Percentage
type: Property
type: ObjectProperty
range: float
comment: Indication of range in percent of the given cooking / roasting loss. Percentage that the actual weight of the trade item differs upward or downward from the average or estimated product yield.
domain: Food and Beverage Preparation Information
term status: testing

Ingredient Sequence
type: Property
type: DatatypeProperty
range: integer
comment: Integer (1, 2, 3...) indicating the ingredient order by content percentage of the product. (major ingredient = 1, second ingredient = 2) etc.
domain: Food Beverage Tobacco Ingredient
term status: testing

Ingredient Name
type: Property
type: DatatypeProperty
range: string
comment: Free text field describing an ingredient or ingredient group. Ingredients include any additives (colourings, preservatives, e-numbers, etc.) that are encompassed.
domain: Food Beverage Tobacco Ingredient
term status: testing

Ingredient Content Percentage
type: Property
type: DatatypeProperty
range: float
comment: Percentage of the ingredient contained in the product.
domain: Food Beverage Tobacco Ingredient
term status: testing

Ingredient of Concern
type: Property
type: DatatypeProperty
range: string
comment: Indicates a claim to an ingredient, considered to be a concern for regulatory or other reasons, and which is 'contained' within the trade item but may not need to specify the amount whether approximate, or an accurate measurement be given.
domain: Food Beverage Tobacco Ingredient
term status: testing

Ingredient Statement
type: Property
type: DatatypeProperty
range: string
comment: Information on the constituent ingredient make up of the product specified as one string.
domain: Food Beverage Tobacco Ingredient
term status: testing

Textile Description
type: Property
type: DatatypeProperty
range: string
sub property of: description
comment: This provides a description of the product material for example Rayon. Shall be repeatable for every material in the product.
domain: Textile Material
term status: testing

Textile Material Content
type: Property
type: DatatypeProperty
range: string
sub property of: description
comment: A description of the material composition used in conjunction with the material percentage.
domain: Textile Material
term status: testing

Textile Material Percentage
type: Property
type: DatatypeProperty
range: float
comment: Net weight percentage of a product material of the first main material.
domain: Textile Material
term status: testing

Textile Material Thread Count
type: Property
type: DatatypeProperty
range: string
comment: The quality of material (fabric) of a trade item based on the total number of vertical and horizontal threads in one square inch.
domain: Textile Material
term status: testing

Textile Material Weight
type: Property
type: ObjectProperty
range: Measurement Type
comment: The measured weight of the material expressed in ounces per square yard or grams per square meter.
domain: Textile Material
term status: testing